{"text_format":"1","workbook":"xlsx","n_sheets":3,"sheets":["Notes Balance","Cumulative Defaults","Collateral Tables"],"not_rendered":{"charts":1,"images":0,"macros":1,"external_links":5,"defined_names":24,"comments":1,"pivot_tables":0},"unopened":[],"bounds":{"document_bytes":16777216,"sheet_cells":100000,"rows_first":2000,"rows_last":500,"rows_between":2000,"halvings":0,"cell_chars":16384,"cell_head_chars":4096},"cells_cut":0,"cells_raw":0,"read":"whole","date_system":"1900"}

{"sheet":"Notes Balance","index":0,"n_rows":20,"n_cols":6,"rows_kept":20,"cut":false,"hidden":false,"merged":[]}
["TOTAL NOTE BALANCES"]
[null,"Total Notes","Class A1 Notes","Class A2 Notes","Class B Notes","Class C Notes"]
["Initial Invested Amount",{"$f":"SUM(C3:F3)","v":408900000},189325000,200000000,10875000,8700000]
["Invested Amount as at Previous Payment Date:  17 August 2020",{"$f":"SUM(C4:F4)","v":408900000},189325000,200000000,10875000,8700000]
["Stated Amount as at Previous Payment Date:  17 August 2020",408900000,189325000,200000000,10875000,8700000]
["Principal Payments to Noteholders on Payment Date",34777204.240000002,34777204.240000002,0,0,0]
["Gross Aggregate Charge-Offs",{"$f":"SUM(C7:G7)","v":0},0,0,0,0]
["Gross Aggregate Reinstatements of charge-offs",0,0,0,0,0]
["Aggregate Charge-Offs for this Collection Period",0,0,0,0,0]
["Reinstatements relating to Charge-offs that have occurred this Collection Period",0,0,0,0,0]
["Aggregate Carry Over Charge-offs not previously reinstated",0,0,0,0,0]
["Reinstatements of Carry Over Charge-offs not previously reinstated",0,0,0,0,0]
["Aggregate Charge-Offs not reinstated and to be carried over to next period",0,0,0,0,0]
["Invested Amount as at Payment Date:  16 November 2020",374122795.75999999,154547795.75999999,200000000,10875000,8700000]
["Stated Amount as at Payment Date:  16 November 2020",374122795.75999999,154547795.75999999,200000000,10875000,8700000]
["Bond Factor at Payment Date:  16 November 2020",null,0.8163094982701703,1,1,1]
["Coupon Margin",null,9.4999999999999998E-3,1.0999999999999999E-2,0,0]
["Coupon Rate (3 month BBSW + margin)",null,1.0499999999999999E-2,1.2E-2,1E-3,1E-3]
["Days in Coupon Period",null,91,91,91,91]
["Coupon Entitlement to be paid out on the current Payment Date: 16 November 2020",null,495616.54,598356.16,2711.3,2169.04]

{"sheet":"Cumulative Defaults","index":1,"n_rows":4,"n_cols":4,"rows_kept":4,"cut":false,"hidden":false,"merged":[]}
["Cumulative Defaults & Losses"]
[]
["Month","Gross Losses","Recoveries","Net Losses"]
["2020-10-01",{"$f":"+'Collateral Tables'!E9/435000000","v":0},{"$f":"+'Collateral Tables'!E23/435000000","v":0},{"$f":"+B4-C4","v":0}]

{"sheet":"Collateral Tables","index":2,"n_rows":246,"n_cols":7,"rows_kept":246,"cut":false,"hidden":false,"merged":[]}
[null,"CNHI CAPITAL AUSTRALIA RECEIVABLES TRUST SERIES 2020-1 (TERM DEAL)"]
[null,"COLLATERAL DATA TABLES"]
[]
[null,"OUTSTANDING RECEIVABLES",null,null,"2020-10-31"]
[]
[null,"Opening Balance",null,null,434999973.20000142]
[null,"Principal Repayments - Scheduled",null,null,{"$f":"MIN(([2]Sheet1!$B$3+[2]Sheet1!$B$4+[2]Sheet1!$B$5+[2]Sheet1!$B$6),'[1]16 Nov 20'!H23)","v":26305441.499999996}]
[null,"Principal Repayments - Unscheduled",null,null,{"$f":"'[1]16 Nov 20'!$H$23-'Collateral Tables'!E7","v":8471735.9399999939}]
[{"$f":"SUM(E9)","v":0},"Charge-Offs",null,null,{"$f":"'[1]16 Nov 20'!$H$37","v":0}]
[null,"Reinstatements"]
[null,"New Receivables Purchased"]
[null,"Non Cash Change in Receivables"]
[null,"Closing Balance",null,null,{"$f":"E6-E7-E8-E9+E10+E11-E12","v":400222795.76000142}]
[]
[null,"PORTFOLIO STATISTICS"]
[]
[null,"Summary"]
[null,"Number of contracts",null,null,{"$f":"[3]Summary!$B$4","v":3459}]
[null,"Dollar value of contracts",null,null,{"$f":"[3]Summary!$B$5","v":400222795.76000023}]
[null,"Number of contracts closed during the Quarter",null,null,{"$f":"[3]Summary!$B$19","v":81}]
[null,"Dollar value of contracts closed during the Quarter",null,null,{"$f":"[3]Summary!$B$20","v":11089284.780000003}]
[]
[{"$f":"SUM(Q23)","v":0},"Dollar Value of Recoveries from Collateral",null,null,{"$f":"[3]Summary!$C$16","v":0}]
[null,"Dollar Value of Recoveries from Other Sources",null,null,0]
[]
[null,"Average Term of Contracts (Months)",null,null,{"$f":"[4]Sheet1!$W$3461","v":54.458787730372293}]
[null,"Average Term to Maturity (Months)",null,null,{"$f":"[4]Sheet1!$X$3461","v":39.320110754577776}]
[null,"Average Residual / Balloon Payment *",null,null,{"$f":"[4]Sheet1!$AI$3461","v":3.7554148495446298E-2}]
[null,"Average Seasoning (Months)",null,null,{"$f":"E26-E27","v":15.138676975794517}]
[null,"Average Dollar Value of Individual Assets",null,null,{"$f":"E19/E18","v":115704.76893899978}]
[null,"Weighted Average Interest Rate",null,null,{"$f":"[4]Sheet1!$AA$3461/100","v":2.2793137532541325E-2}]
[]
[null,"Payment in Arrears"]
["1. 0 - 30 Days","0 - 30 Days",null,null,{"$f":"IFERROR(VLOOKUP($A34,'[5]Arrears Reporting'!$A$1:$D$8,3,FALSE),0)","v":3448},{"$f":"IFERROR(VLOOKUP($A34,'[5]Arrears Reporting'!$A$1:$D$8,2,FALSE),0)","v":608582.11},{"$f":"F34/F$50","v":1.5206083122885025E-3}]
["2. 31 - 60 Days","31 - 60 Days",null,null,{"$f":"IFERROR(VLOOKUP($A35,'[5]Arrears Reporting'!$A$1:$D$8,3,FALSE),0)","v":8},{"$f":"IFERROR(VLOOKUP($A35,'[5]Arrears Reporting'!$A$1:$D$8,2,FALSE),0)","v":239593.93000000002},{"$f":"F35/F$50","v":5.9865138252563753E-4}]
["3. 61 - 90 Days","61 - 90 Days",null,null,{"$f":"IFERROR(VLOOKUP($A36,'[5]Arrears Reporting'!$A$1:$D$8,3,FALSE),0)","v":2},{"$f":"IFERROR(VLOOKUP($A36,'[5]Arrears Reporting'!$A$1:$D$8,2,FALSE),0)","v":134580.25},3.3626332988964257E-4]
["4. 91 - 120 Days","91 - 120 Days",null,null,{"$f":"IFERROR(VLOOKUP($A37,'[5]Arrears Reporting'!$A$1:$D$8,3,FALSE),0)","v":1},{"$f":"IFERROR(VLOOKUP($A37,'[5]Arrears Reporting'!$A$1:$D$8,2,FALSE),0)","v":5840.8499999999985},1.459399629875794E-5]
["5. 121 - 150 Days","121 - 150 Days",null,null,{"$f":"IFERROR(VLOOKUP($A38,'[5]Arrears Reporting'!$A$1:$D$8,3,FALSE),0)","v":0},{"$f":"IFERROR(VLOOKUP($A38,'[5]Arrears Reporting'!$A$1:$D$8,2,FALSE),0)","v":0},0]
["6. 151 - 180 Days","151 - 180 Days",null,null,{"$f":"IFERROR(VLOOKUP($A39,'[5]Arrears Reporting'!$A$1:$D$8,3,FALSE),0)","v":0},{"$f":"IFERROR(VLOOKUP($A39,'[5]Arrears Reporting'!$A$1:$D$8,2,FALSE),0)","v":0},0]
[null,"Total",null,null,{"$f":"SUM(E34:E39)","v":3459},{"$f":"SUM(F34:F39)","v":988597.14},{"$f":"SUM(G34:G39)","v":2.4701170210025408E-3}]
[null,"* Expressed as a % of Aggreg. Rec. closing bal.",null,null,null,"> 30 days",{"$f":"SUM(G35:G39)","v":9.4950870871403803E-4}]
[]
[" 0 - 30 Days","Account Balances in Arrears"]
["1. 0 - 30 Days","0 - 30 Days",null,null,{"$f":"IFERROR(VLOOKUP($A44,'[5]Arrears Reporting'!$A$1:$D$8,3,FALSE),0)","v":3448},{"$f":"IFERROR(VLOOKUP($A44,'[5]Arrears Reporting'!$A$1:$D$8,4,FALSE),0)","v":398525593.33000022},{"$f":"F44/F$50","v":0.99575935591880238}]
["2. 31 - 60 Days","31 - 60 Days",null,null,{"$f":"IFERROR(VLOOKUP($A45,'[5]Arrears Reporting'!$A$1:$D$8,3,FALSE),0)","v":8},{"$f":"IFERROR(VLOOKUP($A45,'[5]Arrears Reporting'!$A$1:$D$8,4,FALSE),0)","v":1107284.19},{"$f":"F45/F$50","v":2.7666694694322208E-3}]
["3. 61 - 90 Days","61 - 90 Days",null,null,{"$f":"IFERROR(VLOOKUP($A46,'[5]Arrears Reporting'!$A$1:$D$8,3,FALSE),0)","v":2},{"$f":"IFERROR(VLOOKUP($A46,'[5]Arrears Reporting'!$A$1:$D$8,4,FALSE),0)","v":543586.31000000006},1.3582092668353904E-3]
["4. 91 - 120 Days","91 - 120 Days",null,null,{"$f":"IFERROR(VLOOKUP($A47,'[5]Arrears Reporting'!$A$1:$D$8,3,FALSE),0)","v":1},{"$f":"IFERROR(VLOOKUP($A47,'[5]Arrears Reporting'!$A$1:$D$8,4,FALSE),0)","v":46331.93},{"$f":"F47/F$50","v":1.1576534492998659E-4}]
["5. 121 - 150 Days","121 - 150 Days",null,null,{"$f":"IFERROR(VLOOKUP($A48,'[5]Arrears Reporting'!$A$1:$D$8,3,FALSE),0)","v":0},{"$f":"IFERROR(VLOOKUP($A48,'[5]Arrears Reporting'!$A$1:$D$8,4,FALSE),0)","v":0},{"$f":"F48/F$50","v":0}]
["6. 151 - 180 Days","151 - 180 Days",null,null,{"$f":"IFERROR(VLOOKUP($A49,'[5]Arrears Reporting'!$A$1:$D$8,3,FALSE),0)","v":0},{"$f":"IFERROR(VLOOKUP($A49,'[5]Arrears Reporting'!$A$1:$D$8,4,FALSE),0)","v":0},{"$f":"F49/F$50","v":0}]
[null,"Total",null,null,{"$f":"SUM(E44:E49)","v":3459},{"$f":"SUM(F44:F49)","v":400222795.76000023},{"$f":"SUM(G44:G49)","v":1}]
["NSW",null,null,null,null,"> 30 days",{"$f":"SUM(G45:G49)","v":4.2406440811975981E-3}]
[null,null,null,null,null,">90 days",{"$f":"SUM(G47:G49)","v":1.1576534492998659E-4}]
[]
["VIC","Geographic Distribution"]
["NSW","New South Wales",null,null,{"$f":"F55/F$63","v":0.24685968916984516},{"$f":"IFERROR(VLOOKUP($A55,'[5]Geographic '!$A$1:$C$10,3,FALSE),0)","v":98798874.960000023}]
["VIC","Victoria",null,null,{"$f":"F56/F$63","v":0.21323032049672458},{"$f":"IFERROR(VLOOKUP($A56,'[5]Geographic '!$A$1:$C$10,3,FALSE),0)","v":85339635.009999946}]
["QLD","Queensland",null,null,0.10911006482545886,{"$f":"IFERROR(VLOOKUP($A57,'[5]Geographic '!$A$1:$C$10,3,FALSE),0)","v":43668335.189999983}]
["SA","South Australia",null,null,0.2000584061883722,{"$f":"IFERROR(VLOOKUP($A58,'[5]Geographic '!$A$1:$C$10,3,FALSE),0)","v":80067934.640000001}]
["NT","Northern Territory",null,null,0,{"$f":"IFERROR(VLOOKUP($A59,'[5]Geographic '!$A$1:$C$10,3,FALSE),0)","v":0}]
["ACT","Australian Capital Territory",null,null,1.1397817036727404E-3,{"$f":"IFERROR(VLOOKUP($A60,'[5]Geographic '!$A$1:$C$10,3,FALSE),0)","v":456166.62}]
["TAS","Tasmania",null,null,1.5793035821453624E-2,{"$f":"IFERROR(VLOOKUP($A61,'[5]Geographic '!$A$1:$C$10,3,FALSE),0)","v":6320732.9499999974}]
["WA","Western Australia",null,null,0.21380870179447287,{"$f":"IFERROR(VLOOKUP($A62,'[5]Geographic '!$A$1:$C$10,3,FALSE),0)","v":85571116.39000006}]
[null,"Total",null,null,{"$f":"SUM(E55:E62)","v":1},{"$f":"SUM(F55:F62)","v":400222795.75999999}]
["AG",null,null,null,null,null,{"$f":"E13-F63","v":1.430511474609375E-6}]
["CE","Top Industry Distribution"]
["AGRICULTURAL MACHINERY","Agricultural",null,null,{"$f":"F66/F$69","v":0.96151115188042091},{"$f":"IFERROR(VLOOKUP($A$66,'[5]Top Industry'!$A$1:$C$4,3,FALSE),)","v":384818681.36000061}]
["CONSTRUCTION EQUIPMENT","Construction",null,null,{"$f":"F67/F$69","v":3.848884811957913E-2},{"$f":"IFERROR(VLOOKUP($A$67,'[5]Top Industry'!$A$1:$C$4,3,FALSE),)","v":15404114.4}]
["MOTOR VEHICLE - AG","Motor Vehicle AG",null,null,{"$f":"F68/F$69","v":0},{"$f":"IFERROR(VLOOKUP($A$68,'[5]Top Industry'!$A$1:$C$4,3,FALSE),)","v":0}]
[null,"Total",null,null,{"$f":"SUM(E66:E68)","v":1},{"$f":"SUM(F66:F68)","v":400222795.76000059},{"$f":"F63-F69","v":-5.9604644775390625E-7}]
["COMBINE"]
["40-100 HP TRACTOR","Collateral Types"]
["100<140 HP TRACTOR","100<140 HP TRACTOR",null,null,{"$f":"IFERROR(F72/F$110,0)","v":0.10041685507614133},{"$f":"IFERROR(VLOOKUP($A72,[5]Collateral!$A$1:$C$35,3,FALSE),\"\")","v":40189114.480000019}]
["4 EWD TRACTORS","4 EWD TRACTORS",null,null,9.7749299351403862E-2,{"$f":"IFERROR(VLOOKUP($A73,[5]Collateral!$A$1:$C$35,3,FALSE),\"\")","v":39121497.869999997}]
["40<60 HP TRACTOR","40<60 HP TRACTOR",null,null,9.7833235424900616E-3,{"$f":"IFERROR(VLOOKUP($A74,[5]Collateral!$A$1:$C$35,3,FALSE),\"\")","v":3915509.0999999982}]
["4WD Vehicle","4WD Vehicle",null,null,2.9054124660537806E-3,{"$f":"IFERROR(VLOOKUP($A75,[5]Collateral!$A$1:$C$35,3,FALSE),\"\")","v":1162812.2999999998}]
["60<100 HP TRACTOR","60<100 HP TRACTOR",null,null,4.6006634867049409E-2,{"$f":"IFERROR(VLOOKUP($A76,[5]Collateral!$A$1:$C$35,3,FALSE),\"\")","v":18412904.030000005}]
["BACKHOE","BACKHOE",null,null,3.622858606158672E-4,{"$f":"IFERROR(VLOOKUP($A77,[5]Collateral!$A$1:$C$35,3,FALSE),\"\")","v":144995.06}]
["BALERS, WINDROWERS, MOWERS, RAKES","BALERS, WINDROWERS, MOWERS, RAKES",null,null,4.0605957487102856E-2,{"$f":"IFERROR(VLOOKUP($A78,[5]Collateral!$A$1:$C$35,3,FALSE),\"\")","v":16251429.830000004}]
["COMBINES","COMBINES",null,null,0.32708290993624445,{"$f":"IFERROR(VLOOKUP($A79,[5]Collateral!$A$1:$C$35,3,FALSE),\"\")","v":130906036.66}]
["COMPACT TRACK LOADER","COMPACT TRACK LOADER",null,null,5.216192436104731E-3,{"$f":"IFERROR(VLOOKUP($A80,[5]Collateral!$A$1:$C$35,3,FALSE),\"\")","v":2087639.1199999999}]
["COMPACT WHEEL LOADER","COMPACT WHEEL LOADER",null,null,6.7083979934266834E-4,{"$f":"IFERROR(VLOOKUP($A81,[5]Collateral!$A$1:$C$35,3,FALSE),\"\")","v":268485.38000000006}]
["CRAWLER EXCAVATOR","CRAWLER EXCAVATOR",null,null,7.4809969639896279E-3,{"$f":"IFERROR(VLOOKUP($A82,[5]Collateral!$A$1:$C$35,3,FALSE),\"\")","v":2994065.52}]
["CRAWLER  DOZER","CRAWLER  DOZER",null,null,1.9781217071771932E-4,{"$f":"IFERROR(VLOOKUP($A83,[5]Collateral!$A$1:$C$35,3,FALSE),\"\")","v":79168.94}]
["CULTIVATORS,SEEDERS, HARROWS","CULTIVATORS,SEEDERS, HARROWS",null,null,1.8602632780729052E-2,{"$f":"IFERROR(VLOOKUP($A84,[5]Collateral!$A$1:$C$35,3,FALSE),\"\")","v":7445197.7000000011}]
["DRILL","DRILL",null,null,9.2039425015884085E-4,{"$f":"IFERROR(VLOOKUP($A85,[5]Collateral!$A$1:$C$35,3,FALSE),\"\")","v":368362.76}]
["DUMP TRUCKS","DUMP TRUCKS",null,null,7.2270920863150989E-5,{"$f":"IFERROR(VLOOKUP($A86,[5]Collateral!$A$1:$C$35,3,FALSE),\"\")","v":28924.469999999994}]
["EXCAVATORS / GRADERS","EXCAVATORS / GRADERS",null,null,5.266989342766165E-4,{"$f":"IFERROR(VLOOKUP($A87,[5]Collateral!$A$1:$C$35,3,FALSE),\"\")","v":210796.91999999987}]
["FEEDERS, MIXERS, WAGONS, BINS, FEED STORAGE","FEEDERS, MIXERS, WAGONS, BINS, FEED STORAGE",null,null,1.2643309810454664E-3,{"$f":"IFERROR(VLOOKUP($A88,[5]Collateral!$A$1:$C$35,3,FALSE),\"\")","v":506014.07999999996}]
["FRONT END LOADER","FRONT END LOADER",null,null,6.4381105406728189E-4,{"$f":"IFERROR(VLOOKUP($A89,[5]Collateral!$A$1:$C$35,3,FALSE),\"\")","v":257667.86}]
["FRONTS","FRONTS",null,null,3.7781679255140701E-3,{"$f":"IFERROR(VLOOKUP($A90,[5]Collateral!$A$1:$C$35,3,FALSE),\"\")","v":1512108.9300000002}]
["GRADER","GRADER",null,null,0,{"$f":"IFERROR(VLOOKUP($A91,[5]Collateral!$A$1:$C$35,3,FALSE),\"\")","v":""}]
["HARVESTERS - Other","HARVESTERS - Other",null,null,1.9737315724357083E-2,{"$f":"IFERROR(VLOOKUP($A92,[5]Collateral!$A$1:$C$35,3,FALSE),\"\")","v":7899323.6799999988}]
["IRRIGATION EQUIPMENT","IRRIGATION EQUIPMENT",null,null,0,{"$f":"IFERROR(VLOOKUP($A93,[5]Collateral!$A$1:$C$35,3,FALSE),\"\")","v":""}]
["MATERIALS HANDLING EQUIPMENT","MATERIALS HANDLING EQUIPMENT",null,null,0,{"$f":"IFERROR(VLOOKUP($A94,[5]Collateral!$A$1:$C$35,3,FALSE),\"\")","v":""}]
["MIDI CRAWLER EXCAVATOR","MIDI CRAWLER EXCAVATOR",null,null,1.2680610534346844E-3,{"$f":"IFERROR(VLOOKUP($A95,[5]Collateral!$A$1:$C$35,3,FALSE),\"\")","v":507506.94}]
["MINI EXCAVATOR","MINI EXCAVATOR",null,null,5.1123271629609024E-3,{"$f":"IFERROR(VLOOKUP($A96,[5]Collateral!$A$1:$C$35,3,FALSE),\"\")","v":2046069.8700000008}]
["OTHER AG","OTHER AG",null,null,1.6185151017445894E-2,{"$f":"IFERROR(VLOOKUP($A97,[5]Collateral!$A$1:$C$35,3,FALSE),\"\")","v":6477666.3900000015}]
["OTHER CE","OTHER CE",null,null,0,{"$f":"IFERROR(VLOOKUP($A98,[5]Collateral!$A$1:$C$35,3,FALSE),\"\")","v":""}]
["OVER 140 HP TRACTOR","OVER 140 HP TRACTOR",null,null,0.20938034891508597,{"$f":"IFERROR(VLOOKUP($A99,[5]Collateral!$A$1:$C$35,3,FALSE),\"\")","v":83798788.61999996}]
["QUAD BIKES","QUAD BIKES",null,null,2.7407659224333244E-5,{"$f":"IFERROR(VLOOKUP($A100,[5]Collateral!$A$1:$C$35,3,FALSE),\"\")","v":10969.17}]
["ROLLER","ROLLER",null,null,3.9739405322473092E-3,{"$f":"IFERROR(VLOOKUP($A101,[5]Collateral!$A$1:$C$35,3,FALSE),\"\")","v":1590461.5899999999}]
["SCRAPERS","SCRAPERS",null,null,0,{"$f":"IFERROR(VLOOKUP($A102,[5]Collateral!$A$1:$C$35,3,FALSE),\"\")","v":""}]
["SKID STEER LOADER","SKID STEER LOADER",null,null,9.8631905324232626E-3,{"$f":"IFERROR(VLOOKUP($A103,[5]Collateral!$A$1:$C$35,3,FALSE),\"\")","v":3947473.69}]
["SKIDSTEER / UNILOADER","SKIDSTEER / UNILOADER",null,null,4.90521834537694E-4,{"$f":"IFERROR(VLOOKUP($A104,[5]Collateral!$A$1:$C$35,3,FALSE),\"\")","v":196318.01999999996}]
["SPRAYING EQUIPMENT","SPRAYING EQUIPMENT",null,null,6.511955632239573E-2,{"$f":"IFERROR(VLOOKUP($A105,[5]Collateral!$A$1:$C$35,3,FALSE),\"\")","v":26062330.889999993}]
["Telehandlers","Telehandlers",null,null,5.5042499411278427E-4,{"$f":"IFERROR(VLOOKUP($A106,[5]Collateral!$A$1:$C$35,3,FALSE),\"\")","v":220292.63}]
["UNDER 40 HP TRACTORS","UNDER 40 HP TRACTORS",null,null,7.5121752979880811E-4,{"$f":"IFERROR(VLOOKUP($A107,[5]Collateral!$A$1:$C$35,3,FALSE),\"\")","v":300654.38}]
["WHEEL LOADERS","WHEEL LOADERS",null,null,2.9328916354477074E-3,{"$f":"IFERROR(VLOOKUP($A108,[5]Collateral!$A$1:$C$35,3,FALSE),\"\")","v":1173810.0899999999}]
["WHEEL LOADERS (OLD)","WHEEL LOADERS (OLD)",null,null,3.2081828261725583E-4,{"$f":"IFERROR(VLOOKUP($A109,[5]Collateral!$A$1:$C$35,3,FALSE),\"\")","v":128398.78999999989}]
[null,"Total",null,null,{"$f":"SUM(E72:E108)","v":0.99967918171738313},{"$f":"SUM(F72:F109)","v":400222795.75999987},{"$f":"F69-F110","v":7.152557373046875E-7}]
["$ 0 - $25,000"]
["$ 25,001 to $50,000","Contract Balance Distribution"]
["$0 - $25,000","$ 0 - $25,000",null,null,{"$f":"IFERROR(F113/F$124,0)","v":2.2574458590854159E-2},{"$f":"IFERROR(VLOOKUP($A113,'[5] Balance Distribution'!$A$1:$C$17,3,FALSE),\"\")","v":9034812.9300000016}]
["$25,001 - $50,000","$ 25,001 to $50,000",null,null,{"$f":"IFERROR(F114/F$124,0)","v":7.3033342527365652E-2},{"$f":"IFERROR(VLOOKUP($A114,'[5] Balance Distribution'!$A$1:$C$17,3,FALSE),\"\")","v":29229608.529999986}]
["$50,001 - $75,000","$ 50,001 to $75,000",null,null,7.4956081157329796E-2,{"$f":"IFERROR(VLOOKUP($A115,'[5] Balance Distribution'!$A$1:$C$17,3,FALSE),\"\")","v":29999132.359999988}]
["$75,001 - $100,000","$ 75,001 to $100,000",null,null,6.3864139026522118E-2,{"$f":"IFERROR(VLOOKUP($A116,'[5] Balance Distribution'!$A$1:$C$17,3,FALSE),\"\")","v":25559884.270000007}]
["$100,001 - $125,000","$100,001 to $125,000",null,null,5.8396196437583939E-2,{"$f":"IFERROR(VLOOKUP($A117,'[5] Balance Distribution'!$A$1:$C$17,3,FALSE),\"\")","v":23371488.999999996}]
["$125,001 - $150,000","$125,001 to $150,000",null,null,6.5373349762139973E-2,{"$f":"IFERROR(VLOOKUP($A118,'[5] Balance Distribution'!$A$1:$C$17,3,FALSE),\"\")","v":26163904.809999991}]
["$150,001 - $200,000","$150,000 to $200,000",null,null,0.11717379366397136,{"$f":"IFERROR(VLOOKUP($A119,'[5] Balance Distribution'!$A$1:$C$17,3,FALSE),\"\")","v":46895623.289999992}]
["$200,001 - $300,000","$200,001 to $300,000",null,null,0.18750423228016472,{"$f":"IFERROR(VLOOKUP($A120,'[5] Balance Distribution'!$A$1:$C$17,3,FALSE),\"\")","v":75043468.059999958}]
{"$rows_left_out":126}